{"text_format":"1","workbook":"xlsx","n_sheets":16,"sheets":["General","DF","CF","BF PARA","BF","AF","JF","DM","CM","BM","AM","JM","Team","Points team et quota finales","Overview","Teams flat"],"not_rendered":{"charts":0,"images":0,"macros":1,"external_links":0,"defined_names":1,"comments":0,"pivot_tables":0},"unopened":[],"bounds":{"document_bytes":16777216,"sheet_cells":100000,"rows_first":2000,"rows_last":500,"rows_between":2000,"halvings":0,"cell_chars":16384,"cell_head_chars":4096},"cells_cut":0,"cells_raw":0,"read":"whole","date_system":"1900"}

{"sheet":"General","index":0,"n_rows":6,"n_cols":2,"rows_kept":6,"cut":false,"hidden":false,"merged":[]}
[]
["TODO: enter the correct values in column 'B'."]
[]
["Key","Value"]
["Contest name","Youth Lead Championship 09-03-2013"]
["President name","Lieven Vlassenroot"]
{"$rows_left_out":1}
{"sheet":"DF","index":1,"n_rows":111,"n_cols":24,"rows_kept":111,"cut":false,"hidden":false,"merged":[[1,0,1,22],[4,4,4,7],[4,9,4,12],[4,15,4,17],[4,18,4,20]]}
[]
[{"$f":"CONCATENATE(General!$B$5,\"  -  RESULTS D Female\")","v":"Youth Lead Championship 09-03-2013  -  RESULTS D Female"}]
[]
[]
["RANK","Nr","Name","Team","Route 1",null,null,null,"Ranking Points Route 1","Route 2",null,null,null,"Ranking Points Route 2","Root R1 x R2 ","Final ",null,null,"Super Final",null,null,"base pour calcul rang","RANK","Team points"]
[{"$f":"RANK(V6,$V$6:$V$105)","v":1},"DF04","DELCOIGNE Lucie","CC","TOP",null,{"$f":"IF(E6=\"TOP\",$F$108,IF(F6=\"-\",E6-0.01,IF(F6=\"+\",E6+0.01,E6)))","v":28},{"$f":"RANK(G6,$G$6:$G$105)","v":1},{"$f":"IF(COUNTIF($H$6:$H$105,H6)=1,H6,(H6*2+COUNTIF($H$6:$H$105,H6)-1)/2)","v":6.5},"TOP",null,{"$f":"IF(J6=\"TOP\",$K$108,IF(K6=\"-\",J6-0.01,IF(K6=\"+\",J6+0.01,J6)))","v":30},{"$f":"RANK(L6,$L$6:$L$105)","v":1},{"$f":"IF(COUNTIF($M$6:$M$105,M6)=1,M6,(M6*2+COUNTIF($M$6:$M$105,M6)-1)/2)","v":1.5},{"$f":"SQRT(I6*N6)","v":3.1224989991991992},"TOP",null,{"$f":"IF(P6=\"TOP\",$Q$108,IF(Q6=\"-\",P6-0.01,IF(Q6=\"+\",P6+0.01,P6)))","v":31},null,null,{"$f":"IF($S6=\"TOP\",$T$108,IF($T6=\"-\",$S6-0.01,IF($T6=\"+\",$S6+0.01,$S6)))","v":0},{"$f":"IF(U6<>0,U6*1000+R6*100+1/O6,IF(R6<>0,R6*100+1/O6,1/O6))","v":3100.3202563076102},{"$f":"A6","v":1},{"$f":"IF(W6<31,AVERAGE(OFFSET(INDEX('Points team et quota finales'!$C$5:$C$34,W6),0,0,COUNTIF($W$6:$W$105,W6))),0)","v":100}]
{"$rows_left_out":106}
{"sheet":"CF","index":2,"n_rows":111,"n_cols":24,"rows_kept":111,"cut":false,"hidden":false,"merged":[[1,0,1,22],[4,4,4,7],[4,9,4,12],[4,15,4,17],[4,18,4,20]]}
[]
[{"$f":"CONCATENATE(General!$B$5,\"  -  RESULTS C Female\")","v":"Youth Lead Championship 09-03-2013  -  RESULTS C Female"}]
[]
[]
["RANK","Nr","Name","Team","Route 1",null,null,null,"Ranking Points Route 1","Route 2",null,null,null,"Ranking Points Route 2","Root R1 x R2 ","Final ",null,null,"Super Final",null,null,"base pour calcul rang","RANK","Team points"]
[{"$f":"RANK(V6,$V$6:$V$105)","v":1},"CF01","TILBORGHS Cathinka","KLI","TOP",null,{"$f":"IF(E6=\"TOP\",$F$108,IF(F6=\"-\",E6-0.01,IF(F6=\"+\",E6+0.01,E6)))","v":30},{"$f":"RANK(G6,$G$6:$G$105)","v":1},{"$f":"IF(COUNTIF($H$6:$H$105,H6)=1,H6,(H6*2+COUNTIF($H$6:$H$105,H6)-1)/2)","v":3},"TOP",null,{"$f":"IF(J6=\"TOP\",$K$108,IF(K6=\"-\",J6-0.01,IF(K6=\"+\",J6+0.01,J6)))","v":28},{"$f":"RANK(L6,$L$6:$L$105)","v":1},{"$f":"IF(COUNTIF($M$6:$M$105,M6)=1,M6,(M6*2+COUNTIF($M$6:$M$105,M6)-1)/2)","v":2},{"$f":"SQRT(I6*N6)","v":2.4494897427831779},28,"+",{"$f":"IF(P6=\"TOP\",$Q$108,IF(Q6=\"-\",P6-0.01,IF(Q6=\"+\",P6+0.01,P6)))","v":28.01},35,null,{"$f":"IF($S6=\"TOP\",$T$108,IF($T6=\"-\",$S6-0.01,IF($T6=\"+\",$S6+0.01,$S6)))","v":35},{"$f":"IF(U6<>0,U6*1000+R6*100+1/O6,IF(R6<>0,R6*100+1/O6,1/O6))","v":37801.408248290463},{"$f":"A6","v":1},{"$f":"IF(W6<31,AVERAGE(OFFSET(INDEX('Points team et quota finales'!$C$5:$C$34,W6),0,0,COUNTIF($W$6:$W$105,W6))),0)","v":100}]
{"$rows_left_out":106}
{"sheet":"BF PARA","index":3,"n_rows":111,"n_cols":24,"rows_kept":111,"cut":false,"hidden":false,"merged":[[1,0,1,22],[4,4,4,7],[4,9,4,12],[4,15,4,17],[4,18,4,20]]}
[]
[{"$f":"CONCATENATE(General!$B$5,\"  -  RESULTS B Female Para\")","v":"Youth Lead Championship 09-03-2013  -  RESULTS B Female Para"}]
[]
[]
["RANK","Nr","Name","Team","Route 1",null,null,null,"Ranking Points Route 1","Route 2",null,null,null,"Ranking Points Route 2","Root R1 x R2 ","Final ",null,null,"Super Final",null,null,"base pour calcul rang","RANK","Team points"]
[{"$f":"RANK(V6,$V$6:$V$105)","v":1},"BFP01","VANDENHOVEN Pavitra","KLI","TOP",null,{"$f":"IF(E6=\"TOP\",$F$108,IF(F6=\"-\",E6-0.01,IF(F6=\"+\",E6+0.01,E6)))","v":26},{"$f":"RANK(G6,$G$6:$G$105)","v":1},{"$f":"IF(COUNTIF($H$6:$H$105,H6)=1,H6,(H6*2+COUNTIF($H$6:$H$105,H6)-1)/2)","v":1},"TOP",null,{"$f":"IF(J6=\"TOP\",$K$108,IF(K6=\"-\",J6-0.01,IF(K6=\"+\",J6+0.01,J6)))","v":33},{"$f":"RANK(L6,$L$6:$L$105)","v":1},{"$f":"IF(COUNTIF($M$6:$M$105,M6)=1,M6,(M6*2+COUNTIF($M$6:$M$105,M6)-1)/2)","v":1},{"$f":"SQRT(I6*N6)","v":1},"TOP",null,{"$f":"IF(P6=\"TOP\",$Q$108,IF(Q6=\"-\",P6-0.01,IF(Q6=\"+\",P6+0.01,P6)))","v":35},null,null,{"$f":"IF($S6=\"TOP\",$T$108,IF($T6=\"-\",$S6-0.01,IF($T6=\"+\",$S6+0.01,$S6)))","v":0},{"$f":"IF(U6<>0,U6*1000+R6*100+1/O6,IF(R6<>0,R6*100+1/O6,1/O6))","v":3501},{"$f":"A6","v":1},{"$f":"IF(W6<31,AVERAGE(OFFSET(INDEX('Points team et quota finales'!$C$5:$C$34,W6),0,0,COUNTIF($W$6:$W$105,W6))),0)","v":100}]
{"$rows_left_out":106}
{"sheet":"BF","index":4,"n_rows":111,"n_cols":24,"rows_kept":111,"cut":false,"hidden":false,"merged":[[1,0,1,22],[4,4,4,7],[4,9,4,12],[4,15,4,17],[4,18,4,20]]}
[]
[{"$f":"CONCATENATE(General!$B$5,\"  -  RESULTS B Female\")","v":"Youth Lead Championship 09-03-2013  -  RESULTS B Female"}]
[]
[]
["RANK","Nr","Name","Team","Route 1",null,null,null,"Ranking Points Route 1","Route 2",null,null,null,"Ranking Points Route 2","Root R1 x R2 ","Final ",null,null,"Super Final",null,null,"base pour calcul rang","RANK","Team points"]
[{"$f":"RANK(V6,$V$6:$V$105)","v":1},"BF03","CUYPERS Celine","KLI","TOP",null,{"$f":"IF(E6=\"TOP\",$F$108,IF(F6=\"-\",E6-0.01,IF(F6=\"+\",E6+0.01,E6)))","v":29},{"$f":"RANK(G6,$G$6:$G$105)","v":1},{"$f":"IF(COUNTIF($H$6:$H$105,H6)=1,H6,(H6*2+COUNTIF($H$6:$H$105,H6)-1)/2)","v":1.5},"TOP",null,{"$f":"IF(J6=\"TOP\",$K$108,IF(K6=\"-\",J6-0.01,IF(K6=\"+\",J6+0.01,J6)))","v":25},{"$f":"RANK(L6,$L$6:$L$105)","v":1},{"$f":"IF(COUNTIF($M$6:$M$105,M6)=1,M6,(M6*2+COUNTIF($M$6:$M$105,M6)-1)/2)","v":2},{"$f":"SQRT(I6*N6)","v":1.7320508075688772},34,"+",{"$f":"IF(P6=\"TOP\",$Q$108,IF(Q6=\"-\",P6-0.01,IF(Q6=\"+\",P6+0.01,P6)))","v":34.01},null,null,{"$f":"IF($S6=\"TOP\",$T$108,IF($T6=\"-\",$S6-0.01,IF($T6=\"+\",$S6+0.01,$S6)))","v":0},{"$f":"IF(U6<>0,U6*1000+R6*100+1/O6,IF(R6<>0,R6*100+1/O6,1/O6))","v":3401.5773502691895},{"$f":"A6","v":1},{"$f":"IF(W6<31,AVERAGE(OFFSET(INDEX('Points team et quota finales'!$C$5:$C$34,W6),0,0,COUNTIF($W$6:$W$105,W6))),0)","v":100}]
{"$rows_left_out":106}
{"sheet":"AF","index":5,"n_rows":111,"n_cols":24,"rows_kept":111,"cut":false,"hidden":false,"merged":[[1,0,1,22],[4,4,4,7],[4,9,4,12],[4,15,4,17],[4,18,4,20]]}
[]
[{"$f":"CONCATENATE(General!$B$5,\"  -  RESULTS A Female\")","v":"Youth Lead Championship 09-03-2013  -  RESULTS A Female"}]
[]
[]
["RANK","Nr","Name","Team","Route 1",null,null,null,"Ranking Points Route 1","Route 2",null,null,null,"Ranking Points Route 2","Root R1 x R2 ","Final ",null,null,"Super Final",null,null,"base pour calcul rang","RANK","Team points"]
[{"$f":"RANK(V6,$V$6:$V$105)","v":1},"AF01","VERHOEVEN Anak","KLI","TOP",null,{"$f":"IF(E6=\"TOP\",$F$108,IF(F6=\"-\",E6-0.01,IF(F6=\"+\",E6+0.01,E6)))","v":24},{"$f":"RANK(G6,$G$6:$G$105)","v":1},{"$f":"IF(COUNTIF($H$6:$H$105,H6)=1,H6,(H6*2+COUNTIF($H$6:$H$105,H6)-1)/2)","v":2},"TOP",null,{"$f":"IF(J6=\"TOP\",$K$108,IF(K6=\"-\",J6-0.01,IF(K6=\"+\",J6+0.01,J6)))","v":36},{"$f":"RANK(L6,$L$6:$L$105)","v":1},{"$f":"IF(COUNTIF($M$6:$M$105,M6)=1,M6,(M6*2+COUNTIF($M$6:$M$105,M6)-1)/2)","v":1.5},{"$f":"SQRT(I6*N6)","v":1.7320508075688772},"TOP",null,{"$f":"IF(P6=\"TOP\",$Q$108,IF(Q6=\"-\",P6-0.01,IF(Q6=\"+\",P6+0.01,P6)))","v":36},null,null,{"$f":"IF($S6=\"TOP\",$T$108,IF($T6=\"-\",$S6-0.01,IF($T6=\"+\",$S6+0.01,$S6)))","v":0},{"$f":"IF(U6<>0,U6*1000+R6*100+1/O6,IF(R6<>0,R6*100+1/O6,1/O6))","v":3600.5773502691895},{"$f":"A6","v":1},{"$f":"IF(W6<31,AVERAGE(OFFSET(INDEX('Points team et quota finales'!$C$5:$C$34,W6),0,0,COUNTIF($W$6:$W$105,W6))),0)","v":100}]
{"$rows_left_out":106}
{"sheet":"JF","index":6,"n_rows":111,"n_cols":24,"rows_kept":111,"cut":false,"hidden":false,"merged":[[1,0,1,22],[4,4,4,7],[4,9,4,12],[4,15,4,17],[4,18,4,20]]}
[]
[{"$f":"CONCATENATE(General!$B$5,\"  -  RESULTS Junior Female\")","v":"Youth Lead Championship 09-03-2013  -  RESULTS Junior Female"}]
[]
[]
["RANK","Nr","Name","Team","Route 1",null,null,null,"Ranking Points Route 1","Route 2",null,null,null,"Ranking Points Route 2","Root R1 x R2 ","Final ",null,null,"Super Final",null,null,"base pour calcul rang","RANK","Team points"]
[{"$f":"RANK(V6,$V$6:$V$105)","v":1},"JF02","GUERIT Emilie","CC","TOP",null,{"$f":"IF(E6=\"TOP\",$F$108,IF(F6=\"-\",E6-0.01,IF(F6=\"+\",E6+0.01,E6)))","v":24},{"$f":"RANK(G6,$G$6:$G$105)","v":1},{"$f":"IF(COUNTIF($H$6:$H$105,H6)=1,H6,(H6*2+COUNTIF($H$6:$H$105,H6)-1)/2)","v":1.5},33,"+",{"$f":"IF(J6=\"TOP\",$K$108,IF(K6=\"-\",J6-0.01,IF(K6=\"+\",J6+0.01,J6)))","v":33.01},{"$f":"RANK(L6,$L$6:$L$105)","v":1},{"$f":"IF(COUNTIF($M$6:$M$105,M6)=1,M6,(M6*2+COUNTIF($M$6:$M$105,M6)-1)/2)","v":1},{"$f":"SQRT(I6*N6)","v":1.2247448713915889},29,null,{"$f":"IF(P6=\"TOP\",$Q$108,IF(Q6=\"-\",P6-0.01,IF(Q6=\"+\",P6+0.01,P6)))","v":29},null,null,{"$f":"IF($S6=\"TOP\",$T$108,IF($T6=\"-\",$S6-0.01,IF($T6=\"+\",$S6+0.01,$S6)))","v":0},{"$f":"IF(U6<>0,U6*1000+R6*100+1/O6,IF(R6<>0,R6*100+1/O6,1/O6))","v":2900.8164965809278},{"$f":"A6","v":1},{"$f":"IF(W6<31,AVERAGE(OFFSET(INDEX('Points team et quota finales'!$C$5:$C$34,W6),0,0,COUNTIF($W$6:$W$105,W6))),0)","v":100}]
{"$rows_left_out":106}
{"sheet":"DM","index":7,"n_rows":110,"n_cols":24,"rows_kept":110,"cut":false,"hidden":false,"merged":[[1,0,1,22],[4,4,4,7],[4,9,4,12],[4,15,4,17],[4,18,4,20]]}
[]
[{"$f":"CONCATENATE(General!$B$5,\"  -  RESULTS D Male\")","v":"Youth Lead Championship 09-03-2013  -  RESULTS D Male"}]
[]
[]
["RANK","Nr","Name","Team","Route 1",null,null,null,"Ranking Points Route 1","Route 2",null,null,null,"Ranking Points Route 2","Root R1 x R2 ","Final ",null,null,"Super Final",null,null,"base pour calcul rang","RANK","Team points"]
[{"$f":"RANK(V6,$V$6:$V$104)","v":1},"DM08","VAN MALDEREN Jasper","KLI","TOP",null,{"$f":"IF(E6=\"TOP\",$F$107,IF(F6=\"-\",E6-0.01,IF(F6=\"+\",E6+0.01,E6)))","v":28},{"$f":"RANK(G6,$G$6:$G$104)","v":1},{"$f":"IF(COUNTIF($H$6:$H$104,H6)=1,H6,(H6*2+COUNTIF($H$6:$H$104,H6)-1)/2)","v":5.5},"TOP",null,{"$f":"IF(J6=\"TOP\",$K$107,IF(K6=\"-\",J6-0.01,IF(K6=\"+\",J6+0.01,J6)))","v":39},{"$f":"RANK(L6,$L$6:$L$104)","v":1},{"$f":"IF(COUNTIF($M$6:$M$104,M6)=1,M6,(M6*2+COUNTIF($M$6:$M$104,M6)-1)/2)","v":2},{"$f":"SQRT(I6*N6)","v":3.3166247903553998},27,null,{"$f":"IF(P6=\"TOP\",$Q$107,IF(Q6=\"-\",P6-0.01,IF(Q6=\"+\",P6+0.01,P6)))","v":27},null,null,{"$f":"IF($S6=\"TOP\",$T$107,IF($T6=\"-\",$S6-0.01,IF($T6=\"+\",$S6+0.01,$S6)))","v":0},{"$f":"IF(U6<>0,U6*1000+R6*100+1/O6,IF(R6<>0,R6*100+1/O6,1/O6))","v":2700.3015113445776},{"$f":"A6","v":1},{"$f":"IF(W6<31,AVERAGE(OFFSET(INDEX('Points team et quota finales'!$C$5:$C$34,W6),0,0,COUNTIF($W$6:$W$104,W6))),0)","v":100}]
{"$rows_left_out":105}
{"sheet":"CM","index":8,"n_rows":108,"n_cols":24,"rows_kept":108,"cut":false,"hidden":false,"merged":[[1,0,1,22],[4,4,4,7],[4,9,4,12],[4,15,4,17],[4,18,4,20]]}
[]
[{"$f":"CONCATENATE(General!$B$5,\"  -  RESULTS C Male\")","v":"Youth Lead Championship 09-03-2013  -  RESULTS C Male"}]
[]
[]
["RANK","Nr","Name","Team","Route 1",null,null,null,"Ranking Points Route 1","Route 2",null,null,null,"Ranking Points Route 2","Root R1 x R2 ","Final ",null,null,"Super Final",null,null,"base pour calcul rang","RANK","Team points"]
[{"$f":"RANK(V6,$V$6:$V$102)","v":1},"CM06","PEETERS Harold","CC","TOP",null,{"$f":"IF(E6=\"TOP\",$F$105,IF(F6=\"-\",E6-0.01,IF(F6=\"+\",E6+0.01,E6)))","v":38},{"$f":"RANK(G6,$G$6:$G$102)","v":1},{"$f":"IF(COUNTIF($H$6:$H$102,H6)=1,H6,(H6*2+COUNTIF($H$6:$H$102,H6)-1)/2)","v":5},"TOP",null,{"$f":"IF(J6=\"TOP\",$K$105,IF(K6=\"-\",J6-0.01,IF(K6=\"+\",J6+0.01,J6)))","v":42},{"$f":"RANK(L6,$L$6:$L$102)","v":1},{"$f":"IF(COUNTIF($M$6:$M$102,M6)=1,M6,(M6*2+COUNTIF($M$6:$M$102,M6)-1)/2)","v":1.5},{"$f":"SQRT(I6*N6)","v":2.7386127875258306},"TOP",null,{"$f":"IF(P6=\"TOP\",$Q$105,IF(Q6=\"-\",P6-0.01,IF(Q6=\"+\",P6+0.01,P6)))","v":49},null,null,{"$f":"IF($S6=\"TOP\",$T$105,IF($T6=\"-\",$S6-0.01,IF($T6=\"+\",$S6+0.01,$S6)))","v":0},{"$f":"IF(U6<>0,U6*1000+R6*100+1/O6,IF(R6<>0,R6*100+1/O6,1/O6))","v":4900.3651483716703},{"$f":"A6","v":1},{"$f":"IF(W6<31,AVERAGE(OFFSET(INDEX('Points team et quota finales'!$C$5:$C$34,W6),0,0,COUNTIF($W$6:$W$102,W6))),0)","v":100}]
{"$rows_left_out":103}
{"sheet":"BM","index":9,"n_rows":109,"n_cols":24,"rows_kept":109,"cut":false,"hidden":false,"merged":[[1,0,1,22],[4,4,4,7],[4,9,4,12],[4,15,4,17],[4,18,4,20]]}
[]
[{"$f":"CONCATENATE(General!$B$5,\"  -  RESULTS B Male\")","v":"Youth Lead Championship 09-03-2013  -  RESULTS B Male"}]
[]
[]
["RANK","Nr","Name","Team","Route 1",null,null,null,"Ranking Points Route 1","Route 2",null,null,null,"Ranking Points Route 2","Root R1 x R2 ","Final ",null,null,"Super Final",null,null,"base pour calcul rang","RANK","Team points"]
[{"$f":"RANK(V6,$V$6:$V$103)","v":1},"BM02","COLLIN Nicolas","STC","TOP",null,{"$f":"IF(E6=\"TOP\",$F$106,IF(F6=\"-\",E6-0.01,IF(F6=\"+\",E6+0.01,E6)))","v":42},{"$f":"RANK(G6,$G$6:$G$103)","v":1},{"$f":"IF(COUNTIF($H$6:$H$103,H6)=1,H6,(H6*2+COUNTIF($H$6:$H$103,H6)-1)/2)","v":3},27,null,{"$f":"IF(J6=\"TOP\",$K$106,IF(K6=\"-\",J6-0.01,IF(K6=\"+\",J6+0.01,J6)))","v":27},{"$f":"RANK(L6,$L$6:$L$103)","v":2},{"$f":"IF(COUNTIF($M$6:$M$103,M6)=1,M6,(M6*2+COUNTIF($M$6:$M$103,M6)-1)/2)","v":2.5},{"$f":"SQRT(I6*N6)","v":2.7386127875258306},"TOP",null,{"$f":"IF(P6=\"TOP\",$Q$106,IF(Q6=\"-\",P6-0.01,IF(Q6=\"+\",P6+0.01,P6)))","v":33},null,null,{"$f":"IF($S6=\"TOP\",$T$106,IF($T6=\"-\",$S6-0.01,IF($T6=\"+\",$S6+0.01,$S6)))","v":0},{"$f":"IF(U6<>0,U6*1000+R6*100+1/O6,IF(R6<>0,R6*100+1/O6,1/O6))","v":3300.3651483716703},{"$f":"A6","v":1},{"$f":"IF(W6<31,AVERAGE(OFFSET(INDEX('Points team et quota finales'!$C$5:$C$34,W6),0,0,COUNTIF($W$6:$W$103,W6))),0)","v":100}]
{"$rows_left_out":104}
{"sheet":"AM","index":10,"n_rows":111,"n_cols":24,"rows_kept":111,"cut":false,"hidden":false,"merged":[[1,0,1,22],[4,4,4,7],[4,9,4,12],[4,15,4,17],[4,18,4,20]]}
[]
[{"$f":"CONCATENATE(General!$B$5,\"  -  RESULTS A Male\")","v":"Youth Lead Championship 09-03-2013  -  RESULTS A Male"}]
[]
[]
["RANK","Nr","Name","Team","Route 1",null,null,null,"Ranking Points Route 1","Route 2",null,null,null,"Ranking Points Route 2","Root R1 x R2 ","Final ",null,null,"Super Final",null,null,"base pour calcul rang","RANK","Team points"]
[{"$f":"RANK(V6,$V$6:$V$105)","v":1},"AM08","VANCAYZEELE Nicolas","CC","TOP",null,{"$f":"IF(E6=\"TOP\",$F$108,IF(F6=\"-\",E6-0.01,IF(F6=\"+\",E6+0.01,E6)))","v":28},{"$f":"RANK(G6,$G$6:$G$105)","v":1},{"$f":"IF(COUNTIF($H$6:$H$105,H6)=1,H6,(H6*2+COUNTIF($H$6:$H$105,H6)-1)/2)","v":1.5},27,"+",{"$f":"IF(J6=\"TOP\",$K$108,IF(K6=\"-\",J6-0.01,IF(K6=\"+\",J6+0.01,J6)))","v":27.01},{"$f":"RANK(L6,$L$6:$L$105)","v":1},{"$f":"IF(COUNTIF($M$6:$M$105,M6)=1,M6,(M6*2+COUNTIF($M$6:$M$105,M6)-1)/2)","v":1.5},{"$f":"SQRT(I6*N6)","v":1.5},34,"+",{"$f":"IF(P6=\"TOP\",$Q$108,IF(Q6=\"-\",P6-0.01,IF(Q6=\"+\",P6+0.01,P6)))","v":34.01},null,null,{"$f":"IF($S6=\"TOP\",$T$108,IF($T6=\"-\",$S6-0.01,IF($T6=\"+\",$S6+0.01,$S6)))","v":0},{"$f":"IF(U6<>0,U6*1000+R6*100+1/O6,IF(R6<>0,R6*100+1/O6,1/O6))","v":3401.6666666666665},{"$f":"A6","v":1},{"$f":"IF(W6<31,AVERAGE(OFFSET(INDEX('Points team et quota finales'!$C$5:$C$34,W6),0,0,COUNTIF($W$6:$W$105,W6))),0)","v":100}]
{"$rows_left_out":106}
{"sheet":"JM","index":11,"n_rows":111,"n_cols":24,"rows_kept":111,"cut":false,"hidden":false,"merged":[[1,0,1,22],[4,4,4,7],[4,9,4,12],[4,15,4,17],[4,18,4,20]]}
[]
[{"$f":"CONCATENATE(General!$B$5,\"  -  RESULTS Junior Male\")","v":"Youth Lead Championship 09-03-2013  -  RESULTS Junior Male"}]
[]
[]
["RANK","Nr","Name","Team","Route 1",null,null,null,"Ranking Points Route 1","Route 2",null,null,null,"Ranking Points Route 2","Root R1 x R2 ","Final ",null,null,"Super Final",null,null,"base pour calcul rang","RANK","Team points"]
[{"$f":"RANK(V6,$V$6:$V$105)","v":1},"JM05","TIMMERMANS Loïc","STC","TOP",null,{"$f":"IF(E6=\"TOP\",$F$108,IF(F6=\"-\",E6-0.01,IF(F6=\"+\",E6+0.01,E6)))","v":28},{"$f":"RANK(G6,$G$6:$G$105)","v":1},{"$f":"IF(COUNTIF($H$6:$H$105,H6)=1,H6,(H6*2+COUNTIF($H$6:$H$105,H6)-1)/2)","v":3},33,"+",{"$f":"IF(J6=\"TOP\",$K$108,IF(K6=\"-\",J6-0.01,IF(K6=\"+\",J6+0.01,J6)))","v":33.01},{"$f":"RANK(L6,$L$6:$L$105)","v":1},{"$f":"IF(COUNTIF($M$6:$M$105,M6)=1,M6,(M6*2+COUNTIF($M$6:$M$105,M6)-1)/2)","v":1},{"$f":"SQRT(I6*N6)","v":1.7320508075688772},"TOP",null,{"$f":"IF(P6=\"TOP\",$Q$108,IF(Q6=\"-\",P6-0.01,IF(Q6=\"+\",P6+0.01,P6)))","v":41},null,null,{"$f":"IF($S6=\"TOP\",$T$108,IF($T6=\"-\",$S6-0.01,IF($T6=\"+\",$S6+0.01,$S6)))","v":0},{"$f":"IF(U6<>0,U6*1000+R6*100+1/O6,IF(R6<>0,R6*100+1/O6,1/O6))","v":4100.57735026919},{"$f":"A6","v":1},{"$f":"IF(W6<31,AVERAGE(OFFSET(INDEX('Points team et quota finales'!$C$5:$C$34,W6),0,0,COUNTIF($W$6:$W$105,W6))),0)","v":100}]
{"$rows_left_out":106}
{"sheet":"Team","index":12,"n_rows":37,"n_cols":39,"rows_kept":37,"cut":false,"hidden":false,"merged":[[2,15,2,17],[2,18,2,20],[2,21,2,23],[1,9,1,23],[0,0,0,6],[1,0,1,6],[2,9,2,11],[2,12,2,14],[1,24,1,38],[2,24,2,26],[2,27,2,29],[2,30,2,32],[2,33,2,35],[2,36,2,38]]}
["TEAM RANKING"]
[{"$f":"General!$B$5","v":"Youth Lead Championship 09-03-2013"},null,null,null,null,null,null,null,null,"Female",null,null,null,null,null,null,null,null,null,null,null,null,null,null,"Male"]
[null,null,null,null,null,null,null,null,null,"D",null,null,"C",null,null,"B",null,null,"A",null,null,"J",null,null,"D",null,null,"C",null,null,"B",null,null,"A",null,null,"J"]
["RANG","Team name","Country","Team","Male","Female","Result",null,null,1,2,3,1,2,3,1,2,3,1,2,3,1,2,3,1,2,3,1,2,3,1,2,3,1,2,3,1,2,3]
[{"$f":"RANK(G5,$G$5:$G$37)","v":10},"Area","BE","ARE",{"$f":"LARGE($Y5:$AM5,1)+LARGE($Y5:$AM5,2)+LARGE($Y5:$AM5,3)","v":77},{"$f":"LARGE($J5:$X5,1)+LARGE($J5:$X5,2)+LARGE($J5:$X5,3)","v":65},{"$f":"ROUND(SUM($E5:$F5),0)","v":142},null,null,{"$f":"LARGE(IF(DF!$D$6:$D$105=Team!$D5,DF!$X$6:$X$105,0),Team!J$4)","v":0},{"$f":"LARGE(IF(DF!$D$6:$D$105=Team!$D5,DF!$X$6:$X$105,0),Team!K$4)","v":0},{"$f":"LARGE(IF(DF!$D$6:$D$105=Team!$D5,DF!$X$6:$X$105,0),Team!L$4)","v":0},{"$f":"LARGE(IF(CF!$D$6:$D$105=Team!$D5,CF!$X$6:$X$105,0),Team!M$4)","v":0},{"$f":"LARGE(IF(CF!$D$6:$D$105=Team!$D5,CF!$X$6:$X$105,0),Team!N$4)","v":0},{"$f":"LARGE(IF(CF!$D$6:$D$105=Team!$D5,CF!$X$6:$X$105,0),Team!O$4)","v":0},{"$f":"LARGE(IF(BF!$D$6:$D$105=Team!$D5,BF!$X$6:$X$105,0),Team!P$4)","v":65},{"$f":"LARGE(IF(BF!$D$6:$D$105=Team!$D5,BF!$X$6:$X$105,0),Team!Q$4)","v":0},{"$f":"LARGE(IF(BF!$D$6:$D$105=Team!$D5,BF!$X$6:$X$105,0),Team!R$4)","v":0},{"$f":"LARGE(IF(AF!$D$6:$D$105=Team!$D5,AF!$X$6:$X$105,0),Team!S$4)","v":0},{"$f":"LARGE(IF(AF!$D$6:$D$105=Team!$D5,AF!$X$6:$X$105,0),Team!T$4)","v":0},{"$f":"LARGE(IF(AF!$D$6:$D$105=Team!$D5,AF!$X$6:$X$105,0),Team!U$4)","v":0},{"$f":"LARGE(IF(JF!$D$6:$D$105=Team!$D5,JF!$X$6:$X$105,0),Team!V$4)","v":0},{"$f":"LARGE(IF(JF!$D$6:$D$105=Team!$D5,JF!$X$6:$X$105,0),Team!W$4)","v":0},{"$f":"LARGE(IF(JF!$D$6:$D$105=Team!$D5,JF!$X$6:$X$105,0),Team!X$4)","v":0},{"$f":"LARGE(IF(DM!$D$6:$D$104=Team!$D5,DM!$X$6:$X$104,0),Team!Y$4)","v":0},{"$f":"LARGE(IF(DM!$D$6:$D$104=Team!$D5,DM!$X$6:$X$104,0),Team!Z$4)","v":0},{"$f":"LARGE(IF(DM!$D$6:$D$104=Team!$D5,DM!$X$6:$X$104,0),Team!AA$4)","v":0},{"$f":"LARGE(IF(CM!$D$6:$D$102=Team!$D5,CM!$X$6:$X$102,0),Team!AB$4)","v":55},{"$f":"LARGE(IF(CM!$D$6:$D$102=Team!$D5,CM!$X$6:$X$102,0),Team!AC$4)","v":0},{"$f":"LARGE(IF(CM!$D$6:$D$102=Team!$D5,CM!$X$6:$X$102,0),Team!AD$4)","v":0},{"$f":"LARGE(IF(BM!$D$6:$D$103=Team!$D5,BM!$X$6:$X$103,0),Team!AE$4)","v":22},{"$f":"LARGE(IF(BM!$D$6:$D$103=Team!$D5,BM!$X$6:$X$103,0),Team!AF$4)","v":0},{"$f":"LARGE(IF(BM!$D$6:$D$103=Team!$D5,BM!$X$6:$X$103,0),Team!AG$4)","v":0},{"$f":"LARGE(IF(AM!$D$6:$D$105=Team!$D5,AM!$X$6:$X$105,0),Team!AH$4)","v":0},{"$f":"LARGE(IF(AM!$D$6:$D$105=Team!$D5,AM!$X$6:$X$105,0),Team!AI$4)","v":0},{"$f":"LARGE(IF(AM!$D$6:$D$105=Team!$D5,AM!$X$6:$X$105,0),Team!AJ$4)","v":0},{"$f":"LARGE(IF(JM!$D$6:$D$105=Team!$D5,JM!$X$6:$X$105,0),Team!AK$4)","v":0},{"$f":"LARGE(IF(JM!$D$6:$D$105=Team!$D5,JM!$X$6:$X$105,0),Team!AL$4)","v":0},{"$f":"LARGE(IF(JM!$D$6:$D$105=Team!$D5,JM!$X$6:$X$105,0),Team!AM$4)","v":0}]
[11,"Bleau Climbing Team","BE","BCT",51,0,51,null,null,{"$f":"LARGE(IF(DF!$D$6:$D$105=Team!$D6,DF!$X$6:$X$105,0),Team!J$4)","v":0},{"$f":"LARGE(IF(DF!$D$6:$D$105=Team!$D6,DF!$X$6:$X$105,0),Team!K$4)","v":0},{"$f":"LARGE(IF(DF!$D$6:$D$105=Team!$D6,DF!$X$6:$X$105,0),Team!L$4)","v":0},{"$f":"LARGE(IF(CF!$D$6:$D$105=Team!$D6,CF!$X$6:$X$105,0),Team!M$4)","v":0},{"$f":"LARGE(IF(CF!$D$6:$D$105=Team!$D6,CF!$X$6:$X$105,0),Team!N$4)","v":0},{"$f":"LARGE(IF(CF!$D$6:$D$105=Team!$D6,CF!$X$6:$X$105,0),Team!O$4)","v":0},{"$f":"LARGE(IF(BF!$D$6:$D$105=Team!$D6,BF!$X$6:$X$105,0),Team!P$4)","v":0},{"$f":"LARGE(IF(BF!$D$6:$D$105=Team!$D6,BF!$X$6:$X$105,0),Team!Q$4)","v":0},{"$f":"LARGE(IF(BF!$D$6:$D$105=Team!$D6,BF!$X$6:$X$105,0),Team!R$4)","v":0},{"$f":"LARGE(IF(AF!$D$6:$D$105=Team!$D6,AF!$X$6:$X$105,0),Team!S$4)","v":0},{"$f":"LARGE(IF(AF!$D$6:$D$105=Team!$D6,AF!$X$6:$X$105,0),Team!T$4)","v":0},{"$f":"LARGE(IF(AF!$D$6:$D$105=Team!$D6,AF!$X$6:$X$105,0),Team!U$4)","v":0},{"$f":"LARGE(IF(JF!$D$6:$D$105=Team!$D6,JF!$X$6:$X$105,0),Team!V$4)","v":0},{"$f":"LARGE(IF(JF!$D$6:$D$105=Team!$D6,JF!$X$6:$X$105,0),Team!W$4)","v":0},{"$f":"LARGE(IF(JF!$D$6:$D$105=Team!$D6,JF!$X$6:$X$105,0),Team!X$4)","v":0},{"$f":"LARGE(IF(DM!$D$6:$D$104=Team!$D6,DM!$X$6:$X$104,0),Team!Y$4)","v":0},{"$f":"LARGE(IF(DM!$D$6:$D$104=Team!$D6,DM!$X$6:$X$104,0),Team!Z$4)","v":0},{"$f":"LARGE(IF(DM!$D$6:$D$104=Team!$D6,DM!$X$6:$X$104,0),Team!AA$4)","v":0},{"$f":"LARGE(IF(CM!$D$6:$D$102=Team!$D6,CM!$X$6:$X$102,0),Team!AB$4)","v":0},{"$f":"LARGE(IF(CM!$D$6:$D$102=Team!$D6,CM!$X$6:$X$102,0),Team!AC$4)","v":0},{"$f":"LARGE(IF(CM!$D$6:$D$102=Team!$D6,CM!$X$6:$X$102,0),Team!AD$4)","v":0},{"$f":"LARGE(IF(BM!$D$6:$D$103=Team!$D6,BM!$X$6:$X$103,0),Team!AE$4)","v":0},{"$f":"LARGE(IF(BM!$D$6:$D$103=Team!$D6,BM!$X$6:$X$103,0),Team!AF$4)","v":0},{"$f":"LARGE(IF(BM!$D$6:$D$103=Team!$D6,BM!$X$6:$X$103,0),Team!AG$4)","v":0},{"$f":"LARGE(IF(AM!$D$6:$D$105=Team!$D6,AM!$X$6:$X$105,0),Team!AH$4)","v":0},{"$f":"LARGE(IF(AM!$D$6:$D$105=Team!$D6,AM!$X$6:$X$105,0),Team!AI$4)","v":0},{"$f":"LARGE(IF(AM!$D$6:$D$105=Team!$D6,AM!$X$6:$X$105,0),Team!AJ$4)","v":0},{"$f":"LARGE(IF(JM!$D$6:$D$105=Team!$D6,JM!$X$6:$X$105,0),Team!AK$4)","v":51},{"$f":"LARGE(IF(JM!$D$6:$D$105=Team!$D6,JM!$X$6:$X$105,0),Team!AL$4)","v":0},{"$f":"LARGE(IF(JM!$D$6:$D$105=Team!$D6,JM!$X$6:$X$105,0),Team!AM$4)","v":0}]
{"$rows_left_out":32}
{"sheet":"Points team et quota finales","index":13,"n_rows":34,"n_cols":7,"rows_kept":34,"cut":false,"hidden":false,"merged":[[2,1,2,2],[1,1,1,2],[1,4,1,6]]}
[]
[null,"Points team",null,null,"QUOTA finales"]
[null,"Référence des points",null,null,"nombre inscrits",null,"nombre finalistes"]
[null,"RANG","POINTS",null,1,0.6,1]
[null,1,100,null,2,1.2,2]
[null,2,80,null,3,1.8,3]
{"$rows_left_out":29}
{"sheet":"Overview","index":14,"n_rows":36,"n_cols":7,"rows_kept":36,"cut":false,"hidden":false,"merged":[]}
[{"$f":"General!$B$5","v":"Youth Lead Championship 09-03-2013"}]
[]
["DF",null,null,null,"DM"]
[1,"DELCOIGNE Lucie","CC",null,1,"VAN MALDEREN Jasper","KLI"]
[2,"TILBORGHS Charlène","KLI",null,2,"FERRARI Luca","STC"]
[3,"VANDERSTRAETEN Justine","CC",null,3,"VANCRAEYNEST Ties","KLI"]
{"$rows_left_out":31}
{"sheet":"Teams flat","index":15,"n_rows":11,"n_cols":3,"rows_kept":11,"cut":false,"hidden":false,"merged":[]}
[1,"Climb Cool",530]
[2,"Klimax",520]
[3,"Stone Climbing Factory",505]
[4,"Escale",440]
[5,"KC Hungaria",279]
[6,"ECT",243]
{"$rows_left_out":5}